{"text_format":"1","workbook":"xlsx","n_sheets":2,"sheets":["Entry form","Explication"],"not_rendered":{"charts":0,"images":4,"macros":0,"external_links":0,"defined_names":20,"comments":0,"pivot_tables":0},"unopened":[],"bounds":{"document_bytes":16777216,"sheet_cells":100000,"rows_first":2000,"rows_last":500,"rows_between":2000,"halvings":0,"cell_chars":16384,"cell_head_chars":4096},"cells_cut":0,"cells_raw":0,"read":"whole","date_system":"1900"}

{"sheet":"Entry form","index":0,"n_rows":83,"n_cols":29,"rows_kept":83,"cut":false,"hidden":false,"merged":[[76,1,76,2],[77,1,77,2],[78,1,78,2],[79,1,79,2],[80,1,80,2],[4,3,4,4],[75,1,75,3],[18,10,18,11],[18,19,18,20],[72,1,72,3],[73,1,73,3],[74,1,74,3],[71,1,71,2]]}
[null,null,null,null,null,null,null,null,null,null,null,null,null,null,null,null,null,null,"Version 1.3"]
[]
[null,null,null,"European Championship 2017"]
[null,null,null,"Santa Maria Maggiore (Verbania) - Italie"]
[null,null,null,"www.ecf2017.it"]
[]
["ECF Member",null,null,null,null,"NON ECF MEMBER",null,"(please indicate your country)"]
["Team leader",null,null,null,null,"Mobile phone"]
["Technical Committee *",null,null,null,null,"Mobile phone"]
[null,"The nations selected at random by ICF outside the GM to make up the Technical  Commission in Santa Maria Maggiore are : Switzerland - Germany - Netherlands"]
[null,"Substitutes, in the following order:  1 Austria. 2 -Czech Republic"]
["*Note : A member of the Technical Committee can not be a competitor/Remarque : Un membre de la Commission Technique ne peut pas être un concurrent"]
[]
[]
[]
["Entry form for National team members"]
[]
[null,"Sportsmen",null,null,null,null,null,null,null,"1st Category",null,null,null,null,null,null,null,null,"2ndCategory",null,null,null,null,null,null,null,null,"TOTAL"]
[null,"Country","Family Name","First Name","Gender","YEAR of birth","Passport Nr or Identity Card Nr","Tshirt Size","Accomodation","1st Category","Year",null,"Check","Fee €","Dog's name","Gender","Date of birth","Chip / Tattoo","2nd Category","Year",null,"Check","Fee €","Dog's name","Gender","Date of birth","Chip / Tattoo","Start Fee"]
[1,null,null,null,null,null,null,null,null,"00. EMPTY",{"$f":"LOOKUP(J$20:J$69,Explication!H$5:H$35,Explication!J$5:J$35)","v":0},{"$f":"LOOKUP(J$20:J$69,Explication!H$5:H$35,Explication!K$5:K$35)","v":0},{"$f":"IF(AND(K20=0),IF(AND(F20<=L20),\"OK\",\"ERROR\"),IF(AND(F20>=L20,F20<=K20),\"OK\",\"ERROR\"))","v":"OK"},{"$f":"LOOKUP(J$20:J$69,Explication!H$5:H$35,Explication!L$5:L$35)","v":0},null,null,null,null,"00. EMPTY",{"$f":"LOOKUP(S$20:S$69,Explication!O$5:O$31,Explication!J$5:J$25)","v":0},{"$f":"LOOKUP(S$20:S$69,Explication!O$5:O$31,Explication!K$5:K$25)","v":0},{"$f":"IF(AND(T20=0),IF(AND(F20<=U20),\"OK 2nd Category\",\"ERROR 2nd Category\"),IF(AND(F20>=U20,F20<=T20),\"OK 2nd Category\",\"ERROR 2nd Category\"))","v":"OK 2nd Category"},{"$f":"LOOKUP(S$20:S$69,Explication!O$5:O$25,Explication!R$5:R$25)","v":0},null,null,null,null,{"$f":" N20+W20","v":0}]
[2,null,null,null,null,null,null,null,null,"00. EMPTY",{"$f":"LOOKUP(J$20:J$69,Explication!H$5:H$35,Explication!J$5:J$25)","v":0},{"$f":"LOOKUP(J$20:J$69,Explication!H$5:H$35,Explication!K$5:K$35)","v":0},"OK",{"$f":"LOOKUP(J$20:J$69,Explication!H$5:H$35,Explication!L$5:L$25)","v":0},null,null,null,null,"00. EMPTY",{"$f":"LOOKUP(S$20:S$69,Explication!O$5:O$31,Explication!J$5:J$25)","v":0},{"$f":"LOOKUP(S$20:S$69,Explication!O$5:O$31,Explication!K$5:K$25)","v":0},{"$f":"IF(AND(T21=0),IF(AND(F21<=U21),\"OK 2nd Category\",\"ERROR 2nd Category\"),IF(AND(F21>=U21,F21<=T21),\"OK 2nd Category\",\"ERROR 2nd Category\"))","v":"OK 2nd Category"},{"$f":"LOOKUP(S$20:S$69,Explication!O$5:O$25,Explication!R$5:R$25)","v":0},null,null,null,null,0]
[3,null,null,null,null,null,null,null,null,"00. EMPTY",{"$f":"LOOKUP(J$20:J$69,Explication!H$5:H$35,Explication!J$5:J$25)","v":0},{"$f":"LOOKUP(J$20:J$69,Explication!H$5:H$35,Explication!K$5:K$35)","v":0},"OK",{"$f":"LOOKUP(J$20:J$69,Explication!H$5:H$35,Explication!L$5:L$25)","v":0},null,null,null,null,"00. EMPTY",{"$f":"LOOKUP(S$20:S$69,Explication!O$5:O$31,Explication!J$5:J$25)","v":0},{"$f":"LOOKUP(S$20:S$69,Explication!O$5:O$31,Explication!K$5:K$25)","v":0},"OK 2nd Category",{"$f":"LOOKUP(S$20:S$69,Explication!O$5:O$25,Explication!R$5:R$25)","v":0},null,null,null,null,0]
[4,null,null,null,null,null,null,null,null,"00. EMPTY",{"$f":"LOOKUP(J$20:J$69,Explication!H$5:H$35,Explication!J$5:J$25)","v":0},{"$f":"LOOKUP(J$20:J$69,Explication!H$5:H$35,Explication!K$5:K$35)","v":0},"OK",{"$f":"LOOKUP(J$20:J$69,Explication!H$5:H$35,Explication!L$5:L$25)","v":0},null,null,null,null,"00. EMPTY",{"$f":"LOOKUP(S$20:S$69,Explication!O$5:O$31,Explication!J$5:J$25)","v":0},{"$f":"LOOKUP(S$20:S$69,Explication!O$5:O$31,Explication!K$5:K$25)","v":0},"OK 2nd Category",{"$f":"LOOKUP(S$20:S$69,Explication!O$5:O$25,Explication!R$5:R$25)","v":0},null,null,null,null,0]
[5,null,null,null,null,null,null,null,null,"00. EMPTY",{"$f":"LOOKUP(J$20:J$69,Explication!H$5:H$35,Explication!J$5:J$25)","v":0},{"$f":"LOOKUP(J$20:J$69,Explication!H$5:H$35,Explication!K$5:K$35)","v":0},"OK",{"$f":"LOOKUP(J$20:J$69,Explication!H$5:H$35,Explication!L$5:L$25)","v":0},null,null,null,null,"00. EMPTY",{"$f":"LOOKUP(S$20:S$69,Explication!O$5:O$31,Explication!J$5:J$25)","v":0},{"$f":"LOOKUP(S$20:S$69,Explication!O$5:O$31,Explication!K$5:K$25)","v":0},"OK 2nd Category",{"$f":"LOOKUP(S$20:S$69,Explication!O$5:O$25,Explication!R$5:R$25)","v":0},null,null,null,null,0]
[6,null,null,null,null,null,null,null,null,"00. EMPTY",{"$f":"LOOKUP(J$20:J$69,Explication!H$5:H$35,Explication!J$5:J$25)","v":0},{"$f":"LOOKUP(J$20:J$69,Explication!H$5:H$35,Explication!K$5:K$35)","v":0},"OK",{"$f":"LOOKUP(J$20:J$69,Explication!H$5:H$35,Explication!L$5:L$25)","v":0},null,null,null,null,"00. EMPTY",{"$f":"LOOKUP(S$20:S$69,Explication!O$5:O$31,Explication!J$5:J$25)","v":0},{"$f":"LOOKUP(S$20:S$69,Explication!O$5:O$31,Explication!K$5:K$25)","v":0},"OK 2nd Category",{"$f":"LOOKUP(S$20:S$69,Explication!O$5:O$25,Explication!R$5:R$25)","v":0},null,null,null,null,0]
[7,null,null,null,null,null,null,null,null,"00. EMPTY",{"$f":"LOOKUP(J$20:J$69,Explication!H$5:H$35,Explication!J$5:J$25)","v":0},{"$f":"LOOKUP(J$20:J$69,Explication!H$5:H$35,Explication!K$5:K$35)","v":0},"OK",{"$f":"LOOKUP(J$20:J$69,Explication!H$5:H$35,Explication!L$5:L$25)","v":0},null,null,null,null,"00. EMPTY",{"$f":"LOOKUP(S$20:S$69,Explication!O$5:O$31,Explication!J$5:J$25)","v":0},{"$f":"LOOKUP(S$20:S$69,Explication!O$5:O$31,Explication!K$5:K$25)","v":0},"OK 2nd Category",{"$f":"LOOKUP(S$20:S$69,Explication!O$5:O$25,Explication!R$5:R$25)","v":0},null,null,null,null,0]
[8,null,null,null,null,null,null,null,null,"00. EMPTY",{"$f":"LOOKUP(J$20:J$69,Explication!H$5:H$35,Explication!J$5:J$25)","v":0},{"$f":"LOOKUP(J$20:J$69,Explication!H$5:H$35,Explication!K$5:K$35)","v":0},"OK",{"$f":"LOOKUP(J$20:J$69,Explication!H$5:H$35,Explication!L$5:L$25)","v":0},null,null,null,null,"00. EMPTY",{"$f":"LOOKUP(S$20:S$69,Explication!O$5:O$31,Explication!J$5:J$25)","v":0},{"$f":"LOOKUP(S$20:S$69,Explication!O$5:O$31,Explication!K$5:K$25)","v":0},"OK 2nd Category",{"$f":"LOOKUP(S$20:S$69,Explication!O$5:O$25,Explication!R$5:R$25)","v":0},null,null,null,null,0]
[9,null,null,null,null,null,null,null,null,"00. EMPTY",{"$f":"LOOKUP(J$20:J$69,Explication!H$5:H$35,Explication!J$5:J$25)","v":0},{"$f":"LOOKUP(J$20:J$69,Explication!H$5:H$35,Explication!K$5:K$35)","v":0},"OK",{"$f":"LOOKUP(J$20:J$69,Explication!H$5:H$35,Explication!L$5:L$25)","v":0},null,null,null,null,"00. EMPTY",{"$f":"LOOKUP(S$20:S$69,Explication!O$5:O$31,Explication!J$5:J$25)","v":0},{"$f":"LOOKUP(S$20:S$69,Explication!O$5:O$31,Explication!K$5:K$25)","v":0},"OK 2nd Category",{"$f":"LOOKUP(S$20:S$69,Explication!O$5:O$25,Explication!R$5:R$25)","v":0},null,null,null,null,0]
[10,null,null,null,null,null,null,null,null,"00. EMPTY",{"$f":"LOOKUP(J$20:J$69,Explication!H$5:H$35,Explication!J$5:J$25)","v":0},{"$f":"LOOKUP(J$20:J$69,Explication!H$5:H$35,Explication!K$5:K$35)","v":0},"OK",{"$f":"LOOKUP(J$20:J$69,Explication!H$5:H$35,Explication!L$5:L$25)","v":0},null,null,null,null,"00. EMPTY",{"$f":"LOOKUP(S$20:S$69,Explication!O$5:O$31,Explication!J$5:J$25)","v":0},{"$f":"LOOKUP(S$20:S$69,Explication!O$5:O$31,Explication!K$5:K$25)","v":0},"OK 2nd Category",{"$f":"LOOKUP(S$20:S$69,Explication!O$5:O$25,Explication!R$5:R$25)","v":0},null,null,null,null,0]
[11,null,null,null,null,null,null,null,null,"00. EMPTY",{"$f":"LOOKUP(J$20:J$69,Explication!H$5:H$35,Explication!J$5:J$25)","v":0},{"$f":"LOOKUP(J$20:J$69,Explication!H$5:H$35,Explication!K$5:K$35)","v":0},"OK",{"$f":"LOOKUP(J$20:J$69,Explication!H$5:H$35,Explication!L$5:L$25)","v":0},null,null,null,null,"00. EMPTY",{"$f":"LOOKUP(S$20:S$69,Explication!O$5:O$31,Explication!J$5:J$25)","v":0},{"$f":"LOOKUP(S$20:S$69,Explication!O$5:O$31,Explication!K$5:K$25)","v":0},"OK 2nd Category",{"$f":"LOOKUP(S$20:S$69,Explication!O$5:O$25,Explication!R$5:R$25)","v":0},null,null,null,null,0]
[12,null,null,null,null,null,null,null,null,"00. EMPTY",{"$f":"LOOKUP(J$20:J$69,Explication!H$5:H$35,Explication!J$5:J$25)","v":0},{"$f":"LOOKUP(J$20:J$69,Explication!H$5:H$35,Explication!K$5:K$35)","v":0},"OK",{"$f":"LOOKUP(J$20:J$69,Explication!H$5:H$35,Explication!L$5:L$25)","v":0},null,null,null,null,"00. EMPTY",{"$f":"LOOKUP(S$20:S$69,Explication!O$5:O$31,Explication!J$5:J$25)","v":0},{"$f":"LOOKUP(S$20:S$69,Explication!O$5:O$31,Explication!K$5:K$25)","v":0},"OK 2nd Category",{"$f":"LOOKUP(S$20:S$69,Explication!O$5:O$25,Explication!R$5:R$25)","v":0},null,null,null,null,0]
[13,null,null,null,null,null,null,null,null,"00. EMPTY",{"$f":"LOOKUP(J$20:J$69,Explication!H$5:H$35,Explication!J$5:J$25)","v":0},{"$f":"LOOKUP(J$20:J$69,Explication!H$5:H$35,Explication!K$5:K$35)","v":0},"OK",{"$f":"LOOKUP(J$20:J$69,Explication!H$5:H$35,Explication!L$5:L$25)","v":0},null,null,null,null,"00. EMPTY",{"$f":"LOOKUP(S$20:S$69,Explication!O$5:O$31,Explication!J$5:J$25)","v":0},{"$f":"LOOKUP(S$20:S$69,Explication!O$5:O$31,Explication!K$5:K$25)","v":0},"OK 2nd Category",{"$f":"LOOKUP(S$20:S$69,Explication!O$5:O$25,Explication!R$5:R$25)","v":0},null,null,null,null,0]
[14,null,null,null,null,null,null,null,null,"00. EMPTY",{"$f":"LOOKUP(J$20:J$69,Explication!H$5:H$35,Explication!J$5:J$25)","v":0},{"$f":"LOOKUP(J$20:J$69,Explication!H$5:H$35,Explication!K$5:K$35)","v":0},"OK",{"$f":"LOOKUP(J$20:J$69,Explication!H$5:H$35,Explication!L$5:L$25)","v":0},null,null,null,null,"00. EMPTY",{"$f":"LOOKUP(S$20:S$69,Explication!O$5:O$31,Explication!J$5:J$25)","v":0},{"$f":"LOOKUP(S$20:S$69,Explication!O$5:O$31,Explication!K$5:K$25)","v":0},"OK 2nd Category",{"$f":"LOOKUP(S$20:S$69,Explication!O$5:O$25,Explication!R$5:R$25)","v":0},null,null,null,null,0]
[15,null,null,null,null,null,null,null,null,"00. EMPTY",{"$f":"LOOKUP(J$20:J$69,Explication!H$5:H$35,Explication!J$5:J$25)","v":0},{"$f":"LOOKUP(J$20:J$69,Explication!H$5:H$35,Explication!K$5:K$35)","v":0},"OK",{"$f":"LOOKUP(J$20:J$69,Explication!H$5:H$35,Explication!L$5:L$25)","v":0},null,null,null,null,"00. EMPTY",{"$f":"LOOKUP(S$20:S$69,Explication!O$5:O$31,Explication!J$5:J$25)","v":0},{"$f":"LOOKUP(S$20:S$69,Explication!O$5:O$31,Explication!K$5:K$25)","v":0},"OK 2nd Category",{"$f":"LOOKUP(S$20:S$69,Explication!O$5:O$25,Explication!R$5:R$25)","v":0},null,null,null,null,0]
[16,null,null,null,null,null,null,null,null,"00. EMPTY",{"$f":"LOOKUP(J$20:J$69,Explication!H$5:H$35,Explication!J$5:J$25)","v":0},{"$f":"LOOKUP(J$20:J$69,Explication!H$5:H$35,Explication!K$5:K$35)","v":0},"OK",{"$f":"LOOKUP(J$20:J$69,Explication!H$5:H$35,Explication!L$5:L$25)","v":0},null,null,null,null,"00. EMPTY",{"$f":"LOOKUP(S$20:S$69,Explication!O$5:O$31,Explication!J$5:J$25)","v":0},{"$f":"LOOKUP(S$20:S$69,Explication!O$5:O$31,Explication!K$5:K$25)","v":0},"OK 2nd Category",{"$f":"LOOKUP(S$20:S$69,Explication!O$5:O$25,Explication!R$5:R$25)","v":0},null,null,null,null,0]
[17,null,null,null,null,null,null,null,null,"00. EMPTY",{"$f":"LOOKUP(J$20:J$69,Explication!H$5:H$35,Explication!J$5:J$25)","v":0},{"$f":"LOOKUP(J$20:J$69,Explication!H$5:H$35,Explication!K$5:K$35)","v":0},"OK",{"$f":"LOOKUP(J$20:J$69,Explication!H$5:H$35,Explication!L$5:L$25)","v":0},null,null,null,null,"00. EMPTY",{"$f":"LOOKUP(S$20:S$69,Explication!O$5:O$31,Explication!J$5:J$25)","v":0},{"$f":"LOOKUP(S$20:S$69,Explication!O$5:O$31,Explication!K$5:K$25)","v":0},"OK 2nd Category",{"$f":"LOOKUP(S$20:S$69,Explication!O$5:O$25,Explication!R$5:R$25)","v":0},null,null,null,null,0]
[18,null,null,null,null,null,null,null,null,"00. EMPTY",{"$f":"LOOKUP(J$20:J$69,Explication!H$5:H$35,Explication!J$5:J$25)","v":0},{"$f":"LOOKUP(J$20:J$69,Explication!H$5:H$35,Explication!K$5:K$35)","v":0},"OK",{"$f":"LOOKUP(J$20:J$69,Explication!H$5:H$35,Explication!L$5:L$25)","v":0},null,null,null,null,"00. EMPTY",{"$f":"LOOKUP(S$20:S$69,Explication!O$5:O$31,Explication!J$5:J$25)","v":0},{"$f":"LOOKUP(S$20:S$69,Explication!O$5:O$31,Explication!K$5:K$25)","v":0},"OK 2nd Category",{"$f":"LOOKUP(S$20:S$69,Explication!O$5:O$25,Explication!R$5:R$25)","v":0},null,null,null,null,0]
[19,null,null,null,null,null,null,null,null,"00. EMPTY",{"$f":"LOOKUP(J$20:J$69,Explication!H$5:H$35,Explication!J$5:J$25)","v":0},{"$f":"LOOKUP(J$20:J$69,Explication!H$5:H$35,Explication!K$5:K$35)","v":0},"OK",{"$f":"LOOKUP(J$20:J$69,Explication!H$5:H$35,Explication!L$5:L$25)","v":0},null,null,null,null,"00. EMPTY",{"$f":"LOOKUP(S$20:S$69,Explication!O$5:O$31,Explication!J$5:J$25)","v":0},{"$f":"LOOKUP(S$20:S$69,Explication!O$5:O$31,Explication!K$5:K$25)","v":0},"OK 2nd Category",{"$f":"LOOKUP(S$20:S$69,Explication!O$5:O$25,Explication!R$5:R$25)","v":0},null,null,null,null,0]
[20,null,null,null,null,null,null,null,null,"00. EMPTY",{"$f":"LOOKUP(J$20:J$69,Explication!H$5:H$35,Explication!J$5:J$25)","v":0},{"$f":"LOOKUP(J$20:J$69,Explication!H$5:H$35,Explication!K$5:K$35)","v":0},"OK",{"$f":"LOOKUP(J$20:J$69,Explication!H$5:H$35,Explication!L$5:L$25)","v":0},null,null,null,null,"00. EMPTY",{"$f":"LOOKUP(S$20:S$69,Explication!O$5:O$31,Explication!J$5:J$25)","v":0},{"$f":"LOOKUP(S$20:S$69,Explication!O$5:O$31,Explication!K$5:K$25)","v":0},"OK 2nd Category",{"$f":"LOOKUP(S$20:S$69,Explication!O$5:O$25,Explication!R$5:R$25)","v":0},null,null,null,null,0]
[21,null,null,null,null,null,null,null,null,"00. EMPTY",{"$f":"LOOKUP(J$20:J$69,Explication!H$5:H$35,Explication!J$5:J$25)","v":0},{"$f":"LOOKUP(J$20:J$69,Explication!H$5:H$35,Explication!K$5:K$35)","v":0},"OK",{"$f":"LOOKUP(J$20:J$69,Explication!H$5:H$35,Explication!L$5:L$25)","v":0},null,null,null,null,"00. EMPTY",{"$f":"LOOKUP(S$20:S$69,Explication!O$5:O$31,Explication!J$5:J$25)","v":0},{"$f":"LOOKUP(S$20:S$69,Explication!O$5:O$31,Explication!K$5:K$25)","v":0},"OK 2nd Category",{"$f":"LOOKUP(S$20:S$69,Explication!O$5:O$25,Explication!R$5:R$25)","v":0},null,null,null,null,0]
{"$rows_left_out":44}
{"sheet":"Explication","index":1,"n_rows":50,"n_cols":18,"rows_kept":50,"cut":false,"hidden":false,"merged":[[49,7,49,8],[46,7,46,8],[37,0,37,2],[36,0,36,2],[29,0,29,1],[35,0,35,2],[47,7,47,9],[48,7,48,8],[30,0,30,1],[31,0,31,1],[32,0,32,1],[33,0,33,1],[34,0,34,1]]}
["Explication"]
[]
[]
["ICF Member",null,null,"Country",null,"Gender",null,"Category",null,null,null,null,null,null,"Category","second depart"]
[null,null,null,"Austria",null,"male",null,"00. EMPTY",null,0,0,0,null,null,"00. EMPTY",null,null,0]
["CSEN","Italy",null,"Belgium",null,"female",null,"01 Bike-Jöring Men / Seniors Hommes ","1998-1978",1998,1978,60,null,null,"01 Bike-Jöring Men / Seniors Hommes ","1998-1978",null,30]
["FSCS","Switzerland",null,"Bosnia and Herzegovina",null,null,null,"02 Bike-Jöring Women / Seniors Dames ","1998-1978",1998,1978,60,null,null,"02 Bike-Jöring Women / Seniors Dames ","1998-1978",null,30]
["BSSF","United Kingdom",null,"Czech Republic",null,null,null,"03 Bike-Jöring Master Men I / Vétérans I  Hommes","1977-1968",1977,1968,60,null,null,"03 Bike-Jöring Master Men I / Vétérans I  Hommes","1977-1968",null,30]
["CBA","Austria",null,"Estonia",null,null,null,"04 Bike-Jöring Master Women I / Vétérans I  Dames ","1977-1968",1977,1968,60,null,null,"04 Bike-Jöring Master Women I / Vétérans I  Dames ","1977-1968",null,30]
["CZE","Czech Republic",null,"France",null,null,null,"05 Bike-Jöring Master Men II / Vétérans II  Hommes ","1967-1958",1967,1958,60,null,null,"05 Bike-Jöring Master Mem II / Vétérans II  Hommes ","1967-1958",null,30]
["FCB-BCF","Belgium",null,"Germany",null,null,null,"06 Bike-Jöring Master Women II / Vétérans II  Dames ","1967-1958",1967,1958,60,null,null,"06 Bike-Jöring Master Women II / Vétérans II  Dames ","1967-1958",null,30]
["FSLC","France",null,"Hongria",null,null,null,"07 Bike-Jöring Master Men III / Vétérans III  Hommes ","1957 & before / avant",null,1957,60,null,null,"07 Bike-Jöring Master Men III / Vétérans III  Hommes ","1957 & before / avant",null,30]
["PZSPZ","Poland",null,"Italy",null,null,null,"08 Bike-Jöring Juniors Men / Juniors Garçons","2002-2001-2000-1999",2002,1999,60,null,null,"08 Bike-Jöring Juniors Men / Juniors Garçons","2002-2001-2000-1999",null,30]
["MCSE","Hongria",null,"Iceland",null,null,null,"09 Bike-Jöring Juniors Women / Juniors Filles ","2002-2001-2000-1999",2002,1999,60,null,null,"09 Bike-Jöring Juniors Women / Juniors Filles ","2002-2001-2000-1999",null,30]
["RFEDI","Spain",null,"Ireland",null,null,null,"10 Bike-Jöring Master Women III / Vétérans III  Dames ","1957 & before / avant",null,1957,60,null,null,"10 Bike-Jöring Master Women III / Vétérans III  Dames ","1957 & before / avant",null,30]
["SKVVP","Slowenia",null,"Latvia",null,null,null,"11 Scooter Men / Seniors Hommes  ","1998-1978",1998,1978,60,null,null,"11 Scooter Men / Seniors Hommes  ","1998-1978",null,30]
["CCNL","Netherlands",null,"Lithuania",null,null,null,"12 Scooter Women / Seniors Dames  ","1998-1978",1998,1978,60,null,null,"12 Scooter Women / Seniors Dames  ","1998-1978",null,30]
["VDSV","Germany",null,"Luxembourg",null,null,null,"13 Scooter Master Men / Vétérans Hommes ","1977 & before / avant",null,1977,60,null,null,"13 Scooter Master Men / Vétérans Hommes ","1977 & before / avant",null,30]
["SLVK","Slovakia",null,"Netherlands",null,null,null,"14 Scooter Master Women / Vétérans Dames ","1977 & before / avant",null,1977,60,null,null,"14 Scooter Master Women / Vétérans Dames ","1977 & before / avant",null,30]
["UKR","Ukraine",null,"Poland",null,null,null,"15 Scooter Juniors Men / Juniors Hommes ","2002-2001-2000-1999",2002,1999,60,null,null,"15 Scooter Juniors Men / Juniors Hommes ","2002-2001-2000-1999",null,30]
["EIRE","Ireland",null,"Russia",null,null,null,"16 Scooter Juniors Women / Juniors Filles","2002-2001-2000-1999",2002,1999,60,null,null,"16 Scooter Juniors Women / Juniors Filles","2002-2001-2000-1999",null,30]
["RCF","Russia",null,"Slovakia",null,null,null,"17 Canicross Men / Seniors Hommes ","1998-1978",1998,1978,60,null,null,"17 Canicross Men / Seniors Hommes ","1998-1978",null,30]
[null,"Other country",null,"Slowenia",null,null,null,"18 Canicross Women / Seniors Dames ","1998-1978",1998,1978,60,null,null,"18 Canicross Women / Seniors Dames ","1998-1978",null,30]
[null,null,null,"Spain",null,null,null,"19 Canicross Master Men I / Vétérans I  Hommes ","1977-1968",1977,1968,60,null,null,"19 Canicross Master Men I / Vétérans I  Hommes ","1977-1968",null,30]
[null,null,null,"Switzerland",null,null,null,"20 Canicross Master Women I / Vétérans I  Dames ","1977-1968",1977,1968,60,null,null,"20 Canicross Master Women I / Vétérans I  Dames ","1977-1968",null,30]
[null,null,null,"Ukraine",null,null,null,"21 Canicross Master Men II / Vétérans II  Hommes ","1997-1958",1967,1958,60,null,null,"21 Canicross Master Men II / Vétérans II  Hommes ","1997-1958",null,30]
[null,null,null,"United Kingdom",null,null,null,"22 Canicross Master Women II / Vétérans II  Dames ","1997-1958",1967,1958,60,null,null,"22 Canicross Master Women II / Vétérans II  Dames ","1997-1958",null,30]
[null,null,null,"USA",null,null,null,"23 Canicross Master Men III / Vétérans III  Hommes ","1957 & before / avant",null,1957,60,null,null,"23 Canicross Master Men III / Vétérans III  Hommes ","1957 & before / avant",null,30]
[null,null,null,null,null,null,null,"24 Canicross Juniors Men / Juniors Garçons ","2002-2001-2000-1999",2002,1999,60,null,null,"24 Canicross Juniors Men / Juniors Garçons ","2002-2001-2000-1999",null,30]
["5) Coordonnées bancaires :",null," ","Accommodation",null,null,null,"25 Canicross Juniors Women / Juniors Filles  ","2002-2001-2000-1999",2002,1999,60,null,null,"25 Canicross Juniors Women / Juniors Filles  ","2002-2001-2000-1999",null,30]
["Associazione Sportivo Dilettantistica “Dog Eden”",null,null,"IN - Stake-out",null,null,null,"26 Canicross Master Women III / Vétérans III  Dames ","1957 & before / avant",null,1957,60,null,null,"26 Canicross Master Women III / Vétérans III  Dames ","1957 & before / avant",null,30]
["BANQUE: UBI BANCA (UNIONE DI BANCHE ITALIANE) S.C.P.A.",null,null,"OUTSIDE",null,null,null,"27 Canicross School Boys / Minimes Garçons ","2010-2009-2008-2007",2010,2007,40]
["PIAZZA V. VENETO 8   BERGAMO",null,null,null,null,null,null,"28 Canicross Scool Girls / Minimes Filles ","2010-2009-2008-2007",2010,2007,40]
["Iban : IT19M0311150410000000000437  ",null,null,null,null,null,null,"29 Canicross Youg Boys / Cadets Garçons ","2006-2005-2004-2003",2006,2003,40]
["BIC/SWIFT: BLOPIT22",null,null,null,null,null,null,"30 Canicross Youg Girls / Cadets Filles ","2006-2005-2004-2003",2006,2003,40]
[]
["Deadline for the payments: Monday 11/09/2017 at midnight"]
[]
[]
[null,null,null,null,null,null,null,"Deadlines set by ICF"]
{"$rows_left_out":10}